Fix interaction between defaultAdditionalTaintStep and defaultImplicitTaintRead #5073
Annotations
10 errors
Run tests
make: *** [Makefile:55: test] Error 1
|
Run tests:
go/ql/test/experimental/CWE-918/SSRF.qlref#L0
[559/583 comp 17.7s eval 907ms] FAILED(RESULT) /home/runner/work/codeql/codeql/go/ql/test/experimental/CWE-918/SSRF.qlref
|
Run tests:
go/ql/test/query-tests/Security/CWE-089/SqlInjection.qlref#L0
[412/583 comp 18s eval 737ms] FAILED(RESULT) /home/runner/work/codeql/codeql/go/ql/test/query-tests/Security/CWE-089/SqlInjection.qlref
|
Run tests:
go/ql/test/library-tests/semmle/go/frameworks/Gorestful/gorestful.ql#L0
[213/583 comp 17.5s eval 579ms] FAILED(RESULT) /home/runner/work/codeql/codeql/go/ql/test/library-tests/semmle/go/frameworks/Gorestful/gorestful.ql
|
Run tests:
go/ql/test/library-tests/semmle/go/frameworks/Beego/TaintedPath.qlref#L0
[192/583 comp 21.7s eval 1.1s] FAILED(RESULT) /home/runner/work/codeql/codeql/go/ql/test/library-tests/semmle/go/frameworks/Beego/TaintedPath.qlref
|
Run tests:
go/ql/test/library-tests/semmle/go/frameworks/Twirp/RequestForgery.qlref#L0
[188/583 comp 21.9s eval 940ms] FAILED(RESULT) /home/runner/work/codeql/codeql/go/ql/test/library-tests/semmle/go/frameworks/Twirp/RequestForgery.qlref
|
Run tests:
go/ql/test/library-tests/semmle/go/frameworks/Encoding/jsoniter.ql#L0
[158/583 comp 17.4s eval 638ms] FAILED(RESULT) /home/runner/work/codeql/codeql/go/ql/test/library-tests/semmle/go/frameworks/Encoding/jsoniter.ql
|
Run tests:
go/ql/test/library-tests/semmle/go/frameworks/BeegoOrm/StoredXss.qlref#L0
[132/583 comp 17.3s eval 897ms] FAILED(RESULT) /home/runner/work/codeql/codeql/go/ql/test/library-tests/semmle/go/frameworks/BeegoOrm/StoredXss.qlref
|
Run tests:
go/ql/test/library-tests/semmle/go/frameworks/Echo/ReflectedXss.qlref#L0
[128/583 comp 19s eval 963ms] FAILED(RESULT) /home/runner/work/codeql/codeql/go/ql/test/library-tests/semmle/go/frameworks/Echo/ReflectedXss.qlref
|
Run tests:
go/ql/test/library-tests/semmle/go/frameworks/XNetHtml/ReflectedXss.qlref#L0
[122/583 comp 19s eval 670ms] FAILED(RESULT) /home/runner/work/codeql/codeql/go/ql/test/library-tests/semmle/go/frameworks/XNetHtml/ReflectedXss.qlref
|
Loading